Reaction Details
TargetCannabinoid receptor 1
LigandBDBM50056484
Substrate/Competitorn/a
Meas. Tech.ChEMBL_46811 (CHEMBL659697)
Ki 162±n/a nM
Citation Sheskin, THanus, LSlager, JVogel, ZMechoulam, R Structural requirements for binding of anandamide-type compounds to the brain cannabinoid receptor. J Med Chem40:659-67 (1997) 
 
Cannabinoid receptor 1
Name:Cannabinoid receptor 1
Type:G Protein-Coupled Receptor (GPCR)
Mol. Mass.:52856.55
Organism:Rattus norvegicus (rat)
Description:P20272
Residue:473
BDBM50056484
NameBDBM50056484
Synonyms:(5E,8Z,11Z,14Z,17E)-Icosa-5,8,11,14,17-pentaenoic acid (2-hydroxy-ethyl)-amide | CHEMBL161521
TypeSmall organic molecule
Emp. Form.C22H35NO2
Mol. Mass.345.5188
SMILESCC\C=C\C\C=C/C\C=C/C\C=C/C\C=C\CCCC(=O)NCCO