Reaction Details
TargetCannabinoid receptor 1
LigandBDBM50056486
Substrate/Competitorn/a
Meas. Tech.ChEMBL_46811 (CHEMBL659697)
Ki>10000±n/a nM
Citation Sheskin, THanus, LSlager, JVogel, ZMechoulam, R Structural requirements for binding of anandamide-type compounds to the brain cannabinoid receptor. J Med Chem40:659-67 (1997) 
 
Cannabinoid receptor 1
Name:Cannabinoid receptor 1
Type:G Protein-Coupled Receptor (GPCR)
Mol. Mass.:52856.55
Organism:Rattus norvegicus (rat)
Description:P20272
Residue:473
BDBM50056486
NameBDBM50056486
Synonyms:((5Z,8Z)-Icosa-5,8,11,14-tetraenoylamino)-acetic acid Arachidonoyl glycine | CHEMBL161343
TypeSmall organic molecule
Emp. Form.C22H35NO3
Mol. Mass.361.5182
SMILESCCCCC\C=C/C\C=C/C\C=C/C\C=C/CCCC(=O)NCC(O)=O