Reaction Details
TargetCannabinoid receptor 1
LigandBDBM50056488
Substrate/Competitorn/a
Meas. Tech.ChEMBL_46299 (CHEMBL661068)
Ki>10000±n/a nM
Citation Sheskin, THanus, LSlager, JVogel, ZMechoulam, R Structural requirements for binding of anandamide-type compounds to the brain cannabinoid receptor. J Med Chem40:659-67 (1997) 
 
Cannabinoid receptor 1
Name:Cannabinoid receptor 1
Type:G Protein-Coupled Receptor (GPCR)
Mol. Mass.:52868.96
Organism:Homo sapiens (Human)
Description:P21554
Residue:472
BDBM50056488
NameBDBM50056488
Synonyms:(Z)-Icos-11-enoic acid (2-hydroxy-ethyl)-amide | CHEMBL160752
TypeSmall organic molecule
Emp. Form.C22H43NO2
Mol. Mass.353.5823
SMILESCCCCCCCC\C=C/CCCCCCCCCC(=O)NCCO