Reaction Details
TargetCannabinoid receptor 1
LigandBDBM50056488
Substrate/Competitorn/a
Meas. Tech.ChEMBL_46811 (CHEMBL659697)
Ki>1000±n/a nM
Citation Sheskin, THanus, LSlager, JVogel, ZMechoulam, R Structural requirements for binding of anandamide-type compounds to the brain cannabinoid receptor. J Med Chem40:659-67 (1997) 
 
Cannabinoid receptor 1
Name:Cannabinoid receptor 1
Type:G Protein-Coupled Receptor (GPCR)
Mol. Mass.:52856.55
Organism:Rattus norvegicus (rat)
Description:P20272
Residue:473
BDBM50056488
NameBDBM50056488
Synonyms:(Z)-Icos-11-enoic acid (2-hydroxy-ethyl)-amide | CHEMBL160752
TypeSmall organic molecule
Emp. Form.C22H43NO2
Mol. Mass.353.5823
SMILESCCCCCCCC\C=C/CCCCCCCCCC(=O)NCCO