Reaction Details
TargetMu-type opioid receptor
LigandBDBM50454798
Substrate/Competitorn/a
Meas. Tech.ChEMBL_145284 (CHEMBL751220)
Ki 26±n/a nM
Citation Palmer, RBUpthagrove, ALNelson, WL (E)- and (Z)-7-arylidenenaltrexones: synthesis and opioid receptor radioligand displacement assays. J Med Chem40:749-53 (1997) 
 
Mu-type opioid receptor
Name:Mu-type opioid receptor
Type:Enzyme Catalytic Domain
Mol. Mass.:11165.58
Organism:GUINEA PIG
Description:P97266
Residue:98
BDBM50454798
NameBDBM50454798
Synonyms:7-Benzylidenenaltrexone | BNTX
TypeSmall organic molecule
Emp. Form.C27H27NO4
Mol. Mass.429.5076
SMILES[H][C@@]12Oc3c4c(C[C@@]5([H])N(CC6CC6)CC[C@@]14[C@@]5(O)C\C(=C/c1ccccc1)C2=O)ccc3O