Reaction Details
TargetDelta-type opioid receptor
LigandBDBM50056625
Substrate/Competitorn/a
Meas. Tech.ChEMBL_147153 (CHEMBL758178)
Ki 2.4±n/a nM
Citation Palmer, RBUpthagrove, ALNelson, WL (E)- and (Z)-7-arylidenenaltrexones: synthesis and opioid receptor radioligand displacement assays. J Med Chem40:749-53 (1997) 
 
Delta-type opioid receptor
Name:Delta-type opioid receptor
Type:G Protein-Coupled Receptor (GPCR)
Mol. Mass.:40382.98
Organism:Homo sapiens (Human)
Description:Competition binding assays were carried out using membrane preparations from transfected HN9.10 cells that constitutively expressed the delta opioid receptor.
Residue:372
BDBM50056625
NameBDBM50056625
Synonyms:15-[1-(9-anthryl)-(Z)-methylidene]-4-cyclopropylmethyl-10,17-dihydroxy-(5R,13R,17S)-12-oxa-4-azapentacyclo[9.6.1.01,13.05,17.07,18]octadeca-7(18),8,10-trien-14-one CHEMBL350601
TypeSmall organic molecule
Emp. Form.C35H31NO4
Mol. Mass.529.6249
SMILESOc1ccc2C[C@H]3N(CC4CC4)CCC45[C@@H](Oc1c24)C(=O)C(C[C@@]35O)=Cc1c2ccccc2cc2ccccc12