Reaction Details
TargetKappa-type opioid receptor
LigandBDBM50056625
Substrate/Competitorn/a
Meas. Tech.ChEMBL_146524 (CHEMBL753836)
Ki 170±n/a nM
Citation Palmer, RBUpthagrove, ALNelson, WL (E)- and (Z)-7-arylidenenaltrexones: synthesis and opioid receptor radioligand displacement assays. J Med Chem40:749-53 (1997) 
 
Kappa-type opioid receptor
Name:Kappa-type opioid receptor
Type:G Protein-Coupled Receptor (GPCR)
Mol. Mass.:42744.99
Organism:Cavia porcellus (domestic guinea pig)
Description:P41144
Residue:380
BDBM50056625
NameBDBM50056625
Synonyms:15-[1-(9-anthryl)-(Z)-methylidene]-4-cyclopropylmethyl-10,17-dihydroxy-(5R,13R,17S)-12-oxa-4-azapentacyclo[9.6.1.01,13.05,17.07,18]octadeca-7(18),8,10-trien-14-one CHEMBL350601
TypeSmall organic molecule
Emp. Form.C35H31NO4
Mol. Mass.529.6249
SMILESOc1ccc2C[C@H]3N(CC4CC4)CCC45[C@@H](Oc1c24)C(=O)C(C[C@@]35O)=Cc1c2ccccc2cc2ccccc12