Reaction Details
TargetProthrombin
LigandBDBM50454822
Substrate/Competitorn/a
Meas. Tech.ChEMBL_208888 (CHEMBL814945)
Ki 0.090000±n/a nM
Citation Tucker, TJLumma, WCMulichak, AMChen, ZNaylor-Olsen, AMLewis, SDLucas, RFreidinger, RMKuo, LC Design of highly potent noncovalent thrombin inhibitors that utilize a novel lipophilic binding pocket in the thrombin active site. J Med Chem40:830-2 (1997) 
 
Prothrombin
Name:Prothrombin
Type:Protein
Mol. Mass.:70029.57
Organism:Homo sapiens (Human)
Description:P00734
Residue:622
BDBM50454822
NameBDBM50454822
Synonyms:CHEMBL2062141 | L-370518
TypeSmall organic molecule
Emp. Form.C25H37N5O4
Mol. Mass.471.5924
SMILES[H][C@@](NC(=O)[C@@H]1CCCN1C(=O)[C@@H](Cc1ccccc1)NC)(C(=O)C(=O)NC)[C@@]1([H])CC[C@H](N)CC1