Reaction Details
TargetAlpha-1A adrenergic receptor
LigandBDBM50057465
Substrate/Competitorn/a
Meas. Tech.ChEMBL_34012 (CHEMBL645379)
IC50 2±n/a nM
Citation Kenny, BBallard, SBlagg, JFox, D Pharmacological options in the treatment of benign prostatic hyperplasia. J Med Chem40:1293-315 (1997) 
 
Alpha-1A adrenergic receptor
Name:Alpha-1A adrenergic receptor
Type:Protein
Mol. Mass.:51620.15
Organism:Rattus norvegicus (Rat)
Description:P43140
Residue:466
BDBM50057465
NameBDBM50057465
Synonyms:3-Methyl-4-oxo-2-phenyl-4H-chromene-8-carboxylic acid {3-[4-(2-methoxy-phenyl)-piperazin-1-yl]-propyl}-amide Upidosin
TypeSmall organic molecule
Emp. Form.C31H33N3O4
Mol. Mass.511.6114
SMILESCOc1ccccc1N1CCN(CCCNC(=O)c2cccc3c2oc(c(C)c3=O)-c2ccccc2)CC1