Reaction Details
Target3-oxo-5-alpha-steroid 4-dehydrogenase 1
LigandBDBM50039286
Substrate/Competitorn/a
Meas. Tech.ChEMBL_205219 (CHEMBL816493)
Ki 180±n/a nM
Citation Kenny, BBallard, SBlagg, JFox, D Pharmacological options in the treatment of benign prostatic hyperplasia. J Med Chem40:1293-315 (1997) 
 
3-oxo-5-alpha-steroid 4-dehydrogenase 1
Name:3-oxo-5-alpha-steroid 4-dehydrogenase 1
Type:Enzyme
Mol. Mass.:29472.80
Organism:Homo sapiens (Human)
Description:P18405
Residue:259
BDBM50039286
NameBDBM50039286
Synonyms:(1S,9aR,11aS)-9a,11a-Dimethyl-7-oxo-2,3,3a,3b,4,5,7,8,9,9a,9b,10,11,11a-tetradecahydro-1H-cyclopenta[i]phenanthridine-1-carboxylic acid adamantan-2-yl ester | CHEMBL3085538
TypeSmall organic molecule
Emp. Form.C29H41NO3
Mol. Mass.451.6407
SMILES[H][C@@]12CC[C@H](C(=O)OC3[C@@]4([H])C[C@]5([H])C[C@@]([H])(C[C@@]3([H])C5)C4)[C@@]1(C)CC[C@@]1([H])[C@@]2([H])CNC2=CC(=O)CC[C@]12C