Reaction Details
Target3-oxo-5-alpha-steroid 4-dehydrogenase 1
LigandBDBM50057454
Substrate/Competitorn/a
Meas. Tech.ChEMBL_205217 (CHEMBL816491)
IC50 3.3±n/a nM
Citation Kenny, BBallard, SBlagg, JFox, D Pharmacological options in the treatment of benign prostatic hyperplasia. J Med Chem40:1293-315 (1997) 
 
3-oxo-5-alpha-steroid 4-dehydrogenase 1
Name:3-oxo-5-alpha-steroid 4-dehydrogenase 1
Type:Enzyme
Mol. Mass.:29472.80
Organism:Homo sapiens (Human)
Description:P18405
Residue:259
BDBM50057454
NameBDBM50057454
Synonyms:(4aR,6aR,7R,10S)-7-(1,5-Dimethyl-hexyl)-1-ethyl-4a,6a,10-trimethyl-hexadecahydro-indeno[5,4-f]quinolin-2-one | CHEMBL24958
TypeSmall organic molecule
Emp. Form.C29H51NO
Mol. Mass.429.7213
SMILESCCN1C2C[C@H](C)C3C4CC[C@H](C(C)CCCC(C)C)[C@@]4(C)CCC3[C@@]2(C)CCC1=O