Reaction Details
Target3-oxo-5-alpha-steroid 4-dehydrogenase 1
LigandBDBM50039320
Substrate/Competitorn/a
Meas. Tech.ChEMBL_205217 (CHEMBL816491)
IC50 1.7±n/a nM
Citation Kenny, BBallard, SBlagg, JFox, D Pharmacological options in the treatment of benign prostatic hyperplasia. J Med Chem40:1293-315 (1997) 
 
3-oxo-5-alpha-steroid 4-dehydrogenase 1
Name:3-oxo-5-alpha-steroid 4-dehydrogenase 1
Type:Enzyme
Mol. Mass.:29472.80
Organism:Homo sapiens (Human)
Description:P18405
Residue:259
BDBM50039320
NameBDBM50039320
Synonyms:(4aR,6aS,7S)-1,4a,6a-Trimethyl-2-oxo-hexadecahydro-indeno[5,4-f]quinoline-7-carboxylic acid diethylamide | CHEMBL283981
TypeSmall organic molecule
Emp. Form.C24H40N2O2
Mol. Mass.388.5866
SMILESCCN(CC)C(=O)[C@H]1CCC2C3CCC4N(C)C(=O)CC[C@]4(C)C3CC[C@]12C