Reaction Details
Target3-oxo-5-alpha-steroid 4-dehydrogenase 1
LigandBDBM50368906
Substrate/Competitorn/a
Meas. Tech.ChEMBL_205217 (CHEMBL816491)
IC50 0.90±n/a nM
Citation Kenny, BBallard, SBlagg, JFox, D Pharmacological options in the treatment of benign prostatic hyperplasia. J Med Chem40:1293-315 (1997) 
 
3-oxo-5-alpha-steroid 4-dehydrogenase 1
Name:3-oxo-5-alpha-steroid 4-dehydrogenase 1
Type:Enzyme
Mol. Mass.:29472.80
Organism:Homo sapiens (Human)
Description:P18405
Residue:259
BDBM50368906
NameBDBM50368906
Synonyms:CHEMBL25448 | MK-386
TypeSmall organic molecule
Emp. Form.C28H49NO
Mol. Mass.415.6948
SMILESCC(C)CCCC(C)[C@H]1CCC2C3[C@@H](C)CC4N(C)C(=O)CC[C@]4(C)C3CC[C@]12C