Reaction Details
Target3-oxo-5-alpha-steroid 4-dehydrogenase 2
LigandBDBM50057479
Substrate/Competitorn/a
Meas. Tech.ChEMBL_202891 (CHEMBL810008)
IC50 10000±n/a nM
Citation Kenny, BBallard, SBlagg, JFox, D Pharmacological options in the treatment of benign prostatic hyperplasia. J Med Chem40:1293-315 (1997) 
 
3-oxo-5-alpha-steroid 4-dehydrogenase 2
Name:3-oxo-5-alpha-steroid 4-dehydrogenase 2
Type:Enzyme
Mol. Mass.:28406.59
Organism:Homo sapiens (Human)
Description:P31213
Residue:254
BDBM50057479
NameBDBM50057479
Synonyms:7-Bromo-9,10-dihydro-phenanthrene-2-carboxylic acid | CHEMBL25578
TypeSmall organic molecule
Emp. Form.C15H11BrO2
Mol. Mass.303.151
SMILESOC(=O)c1ccc-2c(CCc3cc(Br)ccc-23)c1