Reaction Details
Target3 beta-hydroxysteroid dehydrogenase/Delta 5-->4-isomerase type 1
LigandBDBM50031889
Substrate/Competitorn/a
Meas. Tech.ChEMBL_329 (CHEMBL615302)
Ki 160±n/a nM
Citation Kenny, BBallard, SBlagg, JFox, D Pharmacological options in the treatment of benign prostatic hyperplasia. J Med Chem40:1293-315 (1997) 
 
3 beta-hydroxysteroid dehydrogenase/Delta 5-->4-isomerase type 1
Name:3 beta-hydroxysteroid dehydrogenase/Delta 5-->4-isomerase type 1
Type:PROTEIN
Mol. Mass.:42261.17
Organism:Homo sapiens (Human)
Description:ChEMBL_241
Residue:373
BDBM50031889
NameBDBM50031889
Synonyms:(1S,9aR,11aS)-6,9a,11a-Trimethyl-7-oxo-2,3,3a,3b,4,5,7,8,9,9a,9b,10,11,11a-tetradecahydro-1H-cyclopenta[i]phenanthridine-1-carboxylic acid (4-chloro-phenyl)-cyclopentyl-amide | CHEMBL283123
TypeSmall organic molecule
Emp. Form.C31H41ClN2O2
Mol. Mass.509.122
SMILESCC1C(=O)CC[C@]2(C)C3CC[C@@]4(C)C(CC[C@@H]4C(=O)N(C4CCCC4)c4ccc(Cl)cc4)C3CN=C12