Reaction Details
TargetTransporter
LigandBDBM50006774
Substrate/Competitorn/a
Meas. Tech.ChEMBL_142969 (CHEMBL751449)
Ki 80±n/a nM
Citation Emond, PGarreau, LChalon, SBoazi, MCaillet, MBricard, JFrangin, YMauclaire, LBesnard, JCGuilloteau, D Synthesis and ligand binding of nortropane derivatives: N-substituted 2beta-carbomethoxy-3beta-(4'-iodophenyl)nortropane and N-(3-iodoprop-(2E)-enyl)-2beta-carbomethoxy-3beta-(3',4'-disubstituted phenyl)nortropane. New high-affinity and selective compounds for the dopamine transporter. J Med Chem40:1366-72 (1997) 
 
Transporter
Name:Transporter
Type:PROTEIN
Mol. Mass.:66787.87
Organism:Rattus norvegicus
Description:ChEMBL_1463061
Residue:597
BDBM50006774
NameBDBM50006774
Synonyms:(2S,3S)-methyl 3-(4-iodophenyl)-8-methyl-8-aza-bicyclo[3.2.1]octane-2-carboxylate CHEMBL311347 | methyl 3-(4-iodophenyl)-8-methyl-(2S,3S)-8-azabicyclo[3.2.1]octane-2-carboxylate
TypeSmall organic molecule
Emp. Form.C16H20INO2
Mol. Mass.385.24
SMILESCOC(=O)[C@@H]1C2CC[C@H](C[C@@H]1c1ccc(I)cc1)N2C