Reaction Details
TargetSodium-dependent dopamine transporter
LigandBDBM50057622
Substrate/Competitorn/a
Meas. Tech.ChEMBL_62324 (CHEMBL674263)
Ki 93±n/a nM
Citation Emond, PGarreau, LChalon, SBoazi, MCaillet, MBricard, JFrangin, YMauclaire, LBesnard, JCGuilloteau, D Synthesis and ligand binding of nortropane derivatives: N-substituted 2beta-carbomethoxy-3beta-(4'-iodophenyl)nortropane and N-(3-iodoprop-(2E)-enyl)-2beta-carbomethoxy-3beta-(3',4'-disubstituted phenyl)nortropane. New high-affinity and selective compounds for the dopamine transporter. J Med Chem40:1366-72 (1997) 
 
Sodium-dependent dopamine transporter
Name:Sodium-dependent dopamine transporter
Type:Multi-pass membrane protein
Mol. Mass.:68749.45
Organism:Rattus norvegicus (rat)
Description:P23977
Residue:619
BDBM50057622
NameBDBM50057622
Synonyms:(2S,8R)-3-(4-Iodo-phenyl)-8-(2-methyl-benzyl)-8-aza-bicyclo[3.2.1]octane-2-carboxylic acid methyl ester
TypeSmall organic molecule
Emp. Form.C23H26INO2
Mol. Mass.475.3625
SMILESCOC(=O)[C@@H]1C2CCC(CC1c1ccc(I)cc1)N2Cc1ccccc1C