Reaction Details
TargetSigma non-opioid intracellular receptor 1
LigandBDBM21398
Substrate/Competitorn/a
Meas. Tech.ChEMBL_200979 (CHEMBL801232)
Ki 1.6±n/a nM
Citation Ronsisvalle, GMarrazzo, APrezzavento, OPasquinucci, LVittorio, FPittalà, VPappalardo, MSCacciaguerra, SSpampinato, S (+)-cis-N-ethyleneamino-N-normetazocine derivatives. Novel and selective sigma ligands with antagonist properties. J Med Chem41:1574-80 (1998) 
 
Sigma non-opioid intracellular receptor 1
Name:Sigma non-opioid intracellular receptor 1
Type:Enzyme Catalytic Domain
Mol. Mass.:25124.85
Organism:Homo sapiens (Human)
Description:Q99720
Residue:223
BDBM21398
NameBDBM21398
Synonyms:4-[4-(4-Chloro-phenyl)-4-hydroxy-piperidin-1-yl]-1-(4-fluoro-phenyl)-butan-1-one;propionate(HCl) CHEMBL54 Haloperidol | Haloperidol, 1
TypeSmall organic molecule
Emp. Form.C21H23ClFNO2
Mol. Mass.375.864
SMILESOC1(CCN(CCCC(=O)c2ccc(F)cc2)CC1)c1ccc(Cl)cc1