Reaction Details
TargetSigma non-opioid intracellular receptor 1
LigandBDBM50064190
Substrate/Competitorn/a
Meas. Tech.ChEMBL_200979 (CHEMBL801232)
Ki 15±n/a nM
Citation Ronsisvalle, GMarrazzo, APrezzavento, OPasquinucci, LVittorio, FPittalà, VPappalardo, MSCacciaguerra, SSpampinato, S (+)-cis-N-ethyleneamino-N-normetazocine derivatives. Novel and selective sigma ligands with antagonist properties. J Med Chem41:1574-80 (1998) 
 
Sigma non-opioid intracellular receptor 1
Name:Sigma non-opioid intracellular receptor 1
Type:Enzyme Catalytic Domain
Mol. Mass.:25124.85
Organism:Homo sapiens (Human)
Description:Q99720
Residue:223
BDBM50064190
NameBDBM50064190
Synonyms:(2S,6R,11S)-3-(2-Diethylamino-ethyl)-6,11-dimethyl-1,2,3,4,5,6-hexahydro-2,6-methano-benzo[d]azocin-8-ol | CHEMBL39284
TypeSmall organic molecule
Emp. Form.C20H32N2O
Mol. Mass.316.4809
SMILESCCN(CC)CCN1CC[C@]2(C)[C@H](C)[C@@H]1Cc1ccc(O)cc21