Reaction Details
TargetInosine-5'-monophosphate dehydrogenase 2
LigandBDBM50421763
Substrate/Competitorn/a
Meas. Tech.ChEMBL_89941 (CHEMBL699567)
Ki 430±n/a nM
Citation Franchetti, PCappellacci, LPerlini, PJayaram, HNButler, ASchneider, BPCollart, FRHuberman, EGrifantini, M Isosteric analogues of nicotinamide adenine dinucleotide derived from furanfurin, thiophenfurin, and selenophenfurin as mammalian inosine monophosphate dehydrogenase (type I and II) inhibitors. J Med Chem41:1702-7 (1998) 
 
Inosine-5'-monophosphate dehydrogenase 2
Name:Inosine-5'-monophosphate dehydrogenase 2
Type:Enzyme
Mol. Mass.:55806.87
Organism:Homo sapiens (Human)
Description:Recombinant IMPDH2 expressed in E. coli.
Residue:514
BDBM50421763
NameBDBM50421763
Synonyms:CHEMBL2364562
TypeSmall organic molecule
Emp. Form.C19H25N7O14P2S
Mol. Mass.669.453
SMILESNC(=O)c1csc(n1)[C@H]1O[C@@H](COP(O)(=O)OP(O)(=O)OC[C@H]2O[C@H]([C@H](O)[C@@H]2O)n2cnc3c(N)ncnc23)[C@H](O)[C@@H]1O