Reaction Details
TargetAdenosine receptor A3
LigandBDBM50408411
Substrate/Competitorn/a
Meas. Tech.ChEMBL_30611 (CHEMBL642018)
Ki 1082±n/a nM
Citation Franchetti, PCappellacci, LMarchetti, STrincavelli, LMartini, CMazzoni, MRLucacchini, AGrifantini, M 2'-C-Methyl analogues of selective adenosine receptor agonists: synthesis and binding studies. J Med Chem41:1708-15 (1998) 
 
Adenosine receptor A3
Name:Adenosine receptor A3
Type:PROTEIN
Mol. Mass.:36643.73
Organism:Rattus norvegicus
Description:ChEMBL_479910
Residue:320
BDBM50408411
NameBDBM50408411
Synonyms:CHEMBL2113388
TypeSmall organic molecule
Emp. Form.C20H25N5O4
Mol. Mass.399.4436
SMILESC[C@H](Cc1ccccc1)Nc1ncnc2n(cnc12)[C@@H]1O[C@H](CO)[C@@H](O)[C@@]1(C)O