Reaction Details
TargetAdenosine receptor A1
LigandBDBM50369352
Substrate/Competitorn/a
Meas. Tech.ChEMBL_29131 (CHEMBL637553)
Ki 533±n/a nM
Citation Franchetti, PCappellacci, LMarchetti, STrincavelli, LMartini, CMazzoni, MRLucacchini, AGrifantini, M 2'-C-Methyl analogues of selective adenosine receptor agonists: synthesis and binding studies. J Med Chem41:1708-15 (1998) 
 
Adenosine receptor A1
Name:Adenosine receptor A1
Type:Enzyme Catalytic Domain
Mol. Mass.:36602.99
Organism:BOVINE
Description:ADENOSINE 0 BOVINE::P28190
Residue:326
BDBM50369352
NameBDBM50369352
Synonyms:CHEMBL606495
TypeSmall organic molecule
Emp. Form.C11H14ClN5O4
Mol. Mass.315.713
SMILESC[C@@]1(O)[C@H](O)[C@@H](CO)OC1n1cnc2c(N)nc(Cl)nc12