Reaction Details
TargetAdenosine receptor A2a
LigandBDBM50408412
Substrate/Competitorn/a
Meas. Tech.ChEMBL_31057 (CHEMBL873042)
Ki 218±n/a nM
Citation Franchetti, PCappellacci, LMarchetti, STrincavelli, LMartini, CMazzoni, MRLucacchini, AGrifantini, M 2'-C-Methyl analogues of selective adenosine receptor agonists: synthesis and binding studies. J Med Chem41:1708-15 (1998) 
 
Adenosine receptor A2a
Name:Adenosine receptor A2a
Type:G Protein-Coupled Receptor (GPCR)
Mol. Mass.:44716.46
Organism:Homo sapiens (Human)
Description:P29274
Residue:412
BDBM50408412
NameBDBM50408412
Synonyms:CHEMBL2113418
TypeSmall organic molecule
Emp. Form.C13H18N6O4
Mol. Mass.322.3198
SMILESCCNC(=O)[C@H]1O[C@@H](n2cnc3c(N)ncnc23)[C@](C)(O)[C@@H]1O