Reaction Details
TargetAdenosine receptor A2a
LigandBDBM50080398
Substrate/Competitorn/a
Meas. Tech.ChEMBL_31057 (CHEMBL873042)
Ki 1800±n/a nM
Citation Franchetti, PCappellacci, LMarchetti, STrincavelli, LMartini, CMazzoni, MRLucacchini, AGrifantini, M 2'-C-Methyl analogues of selective adenosine receptor agonists: synthesis and binding studies. J Med Chem41:1708-15 (1998) 
 
Adenosine receptor A2a
Name:Adenosine receptor A2a
Type:G Protein-Coupled Receptor (GPCR)
Mol. Mass.:44716.46
Organism:Homo sapiens (Human)
Description:P29274
Residue:412
BDBM50080398
NameBDBM50080398
Synonyms:(2R,3S,4R,5R)-2-Hydroxymethyl-5-[6-((S)-1-methyl-2-phenyl-ethylamino)-purin-9-yl]-tetrahydro-furan-3,4-diol CHEMBL420705 | N6-[(S)-1-Methyl-2-phenylethyl]ado (S-PIA)
TypeSmall organic molecule
Emp. Form.C19H23N5O4
Mol. Mass.385.417
SMILESC[C@@H](Cc1ccccc1)Nc1ncnc2n(cnc12)[C@@H]1O[C@H](CO)[C@@H](O)[C@H]1O