Reaction Details
TargetAdenosine receptor A2a
LigandBDBM50118810
Substrate/Competitorn/a
Meas. Tech.ChEMBL_31057 (CHEMBL873042)
Ki 750±n/a nM
Citation Franchetti, PCappellacci, LMarchetti, STrincavelli, LMartini, CMazzoni, MRLucacchini, AGrifantini, M 2'-C-Methyl analogues of selective adenosine receptor agonists: synthesis and binding studies. J Med Chem41:1708-15 (1998) 
 
Adenosine receptor A2a
Name:Adenosine receptor A2a
Type:G Protein-Coupled Receptor (GPCR)
Mol. Mass.:44716.46
Organism:Homo sapiens (Human)
Description:P29274
Residue:412
BDBM50118810
NameBDBM50118810
Synonyms:(2R,3S,4R,5R)-2-(hydroxymethyl)-5-(6-((R)-1-phenylpropan-2-ylamino)-9H-purin-9-yl)-tetrahydrofuran-3,4-diol CHEMBL139000 R-N6-(phenylisopropyl)adenosine
TypeSmall organic molecule
Emp. Form.C19H23N5O4
Mol. Mass.385.417
SMILESC[C@H](Cc1ccccc1)Nc1ncnc2n(cnc12)[C@@H]1O[C@H](CO)[C@@H](O)[C@H]1O