Reaction Details
TargetAdenosine receptor A1
LigandBDBM50224775
Substrate/Competitorn/a
Meas. Tech.ChEMBL_29131 (CHEMBL637553)
Ki 9.5±n/a nM
Citation Franchetti, PCappellacci, LMarchetti, STrincavelli, LMartini, CMazzoni, MRLucacchini, AGrifantini, M 2'-C-Methyl analogues of selective adenosine receptor agonists: synthesis and binding studies. J Med Chem41:1708-15 (1998) 
 
Adenosine receptor A1
Name:Adenosine receptor A1
Type:Enzyme Catalytic Domain
Mol. Mass.:36602.99
Organism:BOVINE
Description:ADENOSINE 0 BOVINE::P28190
Residue:326
BDBM50224775
NameBDBM50224775
Synonyms:(2R,3R,4R,5R)-2-(6-(cyclopentylamino)-9H-purin-9-yl)-5-(hydroxymethyl)-3-methyl-tetrahydrofuran-3,4-diol | CHEMBL400189
TypeSmall organic molecule
Emp. Form.C16H23N5O4
Mol. Mass.349.3849
SMILESC[C@@]1(O)[C@H](O)[C@@H](CO)O[C@H]1n1cnc2c(NC3CCCC3)ncnc12