Reaction Details
TargetReverse transcriptase/RNaseH
LigandBDBM50408425
Substrate/Competitorn/a
Meas. Tech.ChEMBL_197448 (CHEMBL804233)
IC50 500±n/a nM
Citation von Janta-Lipinski, MCostisella, BOchs, HHübscher, UHafkemeyer, PMatthes, E Newly synthesized L-enantiomers of 3'-fluoro-modified beta-2'-deoxyribonucleoside 5'-triphosphates inhibit hepatitis B DNA polymerases but not the five cellular DNA polymerases alpha, beta, gamma, delta, and epsilon nor HIV-1 reverse transcriptase. J Med Chem41:2040-6 (1998) 
 
Reverse transcriptase/RNaseH
Name:Reverse transcriptase/RNaseH
Type:PROTEIN
Mol. Mass.:65229.15
Organism:Human immunodeficiency virus 1
Description:ChEMBL_1473730
Residue:566
BDBM50408425
NameBDBM50408425
Synonyms:CHEMBL2092835
TypeSmall organic molecule
Emp. Form.C9H15FN3O12P3
Mol. Mass.469.148
SMILESNc1ccn([C@@H]2C[C@@H](F)[C@H](COP(O)(=O)OP(O)(=O)OP(O)(O)=O)O2)c(=O)n1