Reaction Details
TargetReverse transcriptase/RNaseH
LigandBDBM50408428
Substrate/Competitorn/a
Meas. Tech.ChEMBL_197448 (CHEMBL804233)
IC50 70±n/a nM
Citation von Janta-Lipinski, MCostisella, BOchs, HHübscher, UHafkemeyer, PMatthes, E Newly synthesized L-enantiomers of 3'-fluoro-modified beta-2'-deoxyribonucleoside 5'-triphosphates inhibit hepatitis B DNA polymerases but not the five cellular DNA polymerases alpha, beta, gamma, delta, and epsilon nor HIV-1 reverse transcriptase. J Med Chem41:2040-6 (1998) 
 
Reverse transcriptase/RNaseH
Name:Reverse transcriptase/RNaseH
Type:PROTEIN
Mol. Mass.:65229.15
Organism:Human immunodeficiency virus 1
Description:ChEMBL_1473730
Residue:566
BDBM50408428
NameBDBM50408428
Synonyms:CHEMBL2092834
TypeSmall organic molecule
Emp. Form.C9H14FN2O13P3
Mol. Mass.470.1327
SMILESOP(O)(=O)OP(O)(=O)OP(O)(=O)OC[C@@H]1O[C@@H](C[C@H]1F)n1ccc(=O)[nH]c1=O