Reaction Details
TargetMuscarinic acetylcholine receptor M2
LigandBDBM48918
Substrate/Competitorn/a
Meas. Tech.ChEMBL_139634 (CHEMBL748247)
IC50 380±n/a nM
Citation Pei, XFGupta, THBadio, BPadgett, WLDaly, JW 6beta-Acetoxynortropane: a potent muscarinic agonist with apparent selectivity toward M2-receptors. J Med Chem41:2047-55 (1998) 
 
Muscarinic acetylcholine receptor M2
Name:Muscarinic acetylcholine receptor M2
Type:GPCR
Mol. Mass.:51730.61
Organism:Homo sapiens (Human)
Description:P08172
Residue:466
BDBM48918
NameBDBM48918
Synonyms:2-acetoxypropyl(trimethyl)ammonium;chloride 2-acetyloxypropyl(trimethyl)azanium;chloride METHACHOLINE CHLORIDE SMR000059224 | cid_6114
TypeSmall organic molecule
Emp. Form.C8H18NO2
Mol. Mass.160.2335
SMILESCC(C[N+](C)(C)C)OC(C)=O