Reaction Details
TargetMuscarinic acetylcholine receptor M3
LigandBDBM50064609
Substrate/Competitorn/a
Meas. Tech.ChEMBL_138841 (CHEMBL753029)
EC50 3.6±n/a nM
Citation Pei, XFGupta, THBadio, BPadgett, WLDaly, JW 6beta-Acetoxynortropane: a potent muscarinic agonist with apparent selectivity toward M2-receptors. J Med Chem41:2047-55 (1998) 
 
Muscarinic acetylcholine receptor M3
Name:Muscarinic acetylcholine receptor M3
Type:Enzyme Catalytic Domain
Mol. Mass.:66086.66
Organism:RAT
Description:Cholinergic, muscarinic M3 CHRM3 RAT::P08483
Residue:589
BDBM50064609
NameBDBM50064609
Synonyms:6-acetoxy-8-azonia-bicyclo[3.2.1]octane CHEMBL64000
TypeSmall organic molecule
Emp. Form.C9H15NO2
Mol. Mass.169.2209
SMILESCC(=O)OC1CC2CCCC1N2