Reaction Details
TargetMuscarinic acetylcholine receptor M3
LigandBDBM50006243
Substrate/Competitorn/a
Meas. Tech.ChEMBL_138841 (CHEMBL753029)
EC50 130±n/a nM
Citation Pei, XFGupta, THBadio, BPadgett, WLDaly, JW 6beta-Acetoxynortropane: a potent muscarinic agonist with apparent selectivity toward M2-receptors. J Med Chem41:2047-55 (1998) 
 
Muscarinic acetylcholine receptor M3
Name:Muscarinic acetylcholine receptor M3
Type:Enzyme Catalytic Domain
Mol. Mass.:66086.66
Organism:RAT
Description:Cholinergic, muscarinic M3 CHRM3 RAT::P08483
Residue:589
BDBM50006243
NameBDBM50006243
Synonyms:((2S,4R,5S)-4-Hydroxy-5-methyl-tetrahydro-furan-2-ylmethyl)-trimethyl-ammonium CHEMBL12587 | CHEMBL292911
TypeSmall organic molecule
Emp. Form.C9H20NO2
Mol. Mass.174.2601
SMILESC[C@@H]1O[C@H](C[N+](C)(C)C)C[C@H]1O