Reaction Details
TargetProgesterone receptor
LigandBDBM50062429
Substrate/Competitorn/a
Meas. Tech.ChEMBL_159864 (CHEMBL765239)
Ki 0.490000±n/a nM
Citation Edwards, JPZhi, LPooley, CLTegley, CMWest, SJWang, MWGottardis, MMPathirana, CSchrader, WTJones, TK Preparation, resolution, and biological evaluation of 5-aryl-1, 2-dihydro-5H-chromeno[3,4-f]quinolines: potent, orally active, nonsteroidal progesterone receptor agonists. J Med Chem41:2779-85 (1998) 
 
Progesterone receptor
Name:Progesterone receptor
Type:Protein
Mol. Mass.:98979.52
Organism:Homo sapiens (Human)
Description:P06401
Residue:933
BDBM50062429
NameBDBM50062429
Synonyms:5-(4-Chloro-3-methyl-phenyl)-9-fluoro-2,2,4-trimethyl-2,5-dihydro-1H-6-oxa-1-aza-chrysene | CHEMBL94749
TypeSmall organic molecule
Emp. Form.C26H23ClFNO
Mol. Mass.419.918
SMILESCC1=CC(C)(C)Nc2ccc3-c4cc(F)ccc4OC(c4ccc(Cl)c(C)c4)c3c12