Reaction Details
TargetGlucocorticoid receptor
LigandBDBM50062439
Substrate/Competitorn/a
Meas. Tech.ChEMBL_71394 (CHEMBL681746)
Ki 14±n/a nM
Citation Edwards, JPZhi, LPooley, CLTegley, CMWest, SJWang, MWGottardis, MMPathirana, CSchrader, WTJones, TK Preparation, resolution, and biological evaluation of 5-aryl-1, 2-dihydro-5H-chromeno[3,4-f]quinolines: potent, orally active, nonsteroidal progesterone receptor agonists. J Med Chem41:2779-85 (1998) 
 
Glucocorticoid receptor
Name:Glucocorticoid receptor
Type:Enzyme
Mol. Mass.:85656.87
Organism:Homo sapiens (Human)
Description:P04150
Residue:777
BDBM50062439
NameBDBM50062439
Synonyms:9-Chloro-5-(4-chloro-3-methyl-phenyl)-2,2,4-trimethyl-2,5-dihydro-1H-6-oxa-1-aza-chrysene | CHEMBL94753
TypeSmall organic molecule
Emp. Form.C26H23Cl2NO
Mol. Mass.436.373
SMILESCC1=CC(C)(C)Nc2ccc3-c4cc(Cl)ccc4OC(c4ccc(Cl)c(C)c4)c3c12