Reaction Details
TargetPotassium-transporting ATPase alpha chain 2
LigandBDBM50408438
Substrate/Competitorn/a
Meas. Tech.ChEMBL_144101 (CHEMBL751505)
IC50 30±n/a nM
Citation De Munari, SBarassi, PCerri, AFedrizzi, GGobbini, MMabilia, MMelloni, P A new approach to the design of novel inhibitors of Na+,K+-ATPase: 17alpha-substituted seco-D 5beta-androstane as cassaine analogues. J Med Chem41:3033-40 (1998) 
 
Potassium-transporting ATPase alpha chain 2
Name:Potassium-transporting ATPase alpha chain 2
Type:PROTEIN
Mol. Mass.:115509.17
Organism:Homo sapiens (Human)
Description:ChEMBL_144101
Residue:1039
BDBM50408438
NameBDBM50408438
Synonyms:CHEMBL2068911
TypeSmall organic molecule
Emp. Form.C26H43NO4
Mol. Mass.433.6239
SMILESCN(C)CCOC(=O)\C=C\[C@H]1CC[C@]2(O)[C@@H]3CC[C@@H]4C[C@@H](O)CC[C@]4(C)[C@H]3CC[C@]12C