Reaction Details
TargetD(2) dopamine receptor
LigandBDBM50066109
Substrate/Competitorn/a
Meas. Tech.ChEMBL_60219 (CHEMBL672180)
Ki 239±n/a nM
Citation Chern, JWTao, PLWang, KCGutcait, ALiu, SWYen, MHChien, SLRong, JK Studies on quinazolines and 1,2,4-benzothiadiazine 1,1-dioxides. 8.1, 2 synthesis and pharmacological evaluation of tricyclic fused quinazolines and 1,2,4-benzothiadiazine 1,1-dioxides as potential alpha1-adrenoceptor antagonists. J Med Chem41:3128-41 (1998) 
 
D(2) dopamine receptor
Name:D(2) dopamine receptor
Type:Cell-surface receptors
Mol. Mass.:50647.10
Organism:Homo sapiens (Human)
Description:P14416
Residue:443
BDBM50066109
NameBDBM50066109
Synonyms:3-[4-(2-Methoxy-phenyl)-piperazin-1-ylmethyl]-2,6-dihydro-3H-imidazo[1,2-c]quinazolin-5-one | CHEMBL106737
TypeSmall organic molecule
Emp. Form.C22H25N5O2
Mol. Mass.391.4662
SMILESCOc1ccccc1N1CCN(CC2CN=C3N2C(=O)Nc2ccccc32)CC1