Reaction Details
TargetHistamine H1 receptor
LigandBDBM50040253
Substrate/Competitorn/a
Meas. Tech.ChEMBL_83926 (CHEMBL693691)
Ki 685±n/a nM
Citation Chern, JWTao, PLWang, KCGutcait, ALiu, SWYen, MHChien, SLRong, JK Studies on quinazolines and 1,2,4-benzothiadiazine 1,1-dioxides. 8.1, 2 synthesis and pharmacological evaluation of tricyclic fused quinazolines and 1,2,4-benzothiadiazine 1,1-dioxides as potential alpha1-adrenoceptor antagonists. J Med Chem41:3128-41 (1998) 
 
Histamine H1 receptor
Name:Histamine H1 receptor
Type:G Protein-Coupled Receptor (GPCR)
Mol. Mass.:55641.53
Organism:Cavia porcellus (domestic guinea pig)
Description:Guinea pig cerebellum was used in binding assay.
Residue:488
BDBM50040253
NameBDBM50040253
Synonyms:3-{2-[4-(2-Methoxy-phenyl)-piperazin-1-yl]-ethyl}-1H-quinazoline-2,4-dione | CHEMBL51433
TypeSmall organic molecule
Emp. Form.C21H24N4O3
Mol. Mass.380.4403
SMILESCOc1ccccc1N1CCN(CCn2c(=O)[nH]c3ccccc3c2=O)CC1