Reaction Details
TargetP2Y purinoceptor 1
LigandBDBM50062283
Substrate/Competitorn/a
Meas. Tech.ChEMBL_162501 (CHEMBL767302)
EC50 550±n/a nM
Citation Camaioni, EBoyer, JLMohanram, AHarden, TKJacobson, KA Deoxyadenosine bisphosphate derivatives as potent antagonists at P2Y1 receptors. J Med Chem41:183-90 (1998) 
 
P2Y purinoceptor 1
Name:P2Y purinoceptor 1
Type:n/a
Mol. Mass.:41199.64
Organism:Meleagris gallopavo
Description:n/a
Residue:362
BDBM50062283
NameBDBM50062283
Synonyms:CHEMBL43531 | Phosphoric acid mono-[5-(6-amino-2-methylsulfanyl-purin-9-yl)-2-phosphonooxymethyl-tetrahydro-furan-3-yl] ester
TypeSmall organic molecule
Emp. Form.C11H17N5O9P2S
Mol. Mass.457.293
SMILESCSc1nc(N)c2ncn(C3CC(OP(O)(O)=O)C(COP(O)(O)=O)O3)c2n1