Reaction Details
TargetP-selectin
LigandBDBM50067552
Substrate/Competitorn/a
Meas. Tech.ChEMBL_200031 (CHEMBL873252)
IC50 1600±n/a nM
Citation Tsukida, TMoriyama, HKurokawa, KAchiha, TInoue, YKondo, H Studies on selectin blockers. 7. Structure-activity relationships of sialyl Lewis X mimetics based on modified Ser-Glu dipeptides. J Med Chem41:4279-87 (1998) 
 
P-selectin
Name:P-selectin
Type:PROTEIN
Mol. Mass.:90834.61
Organism:Homo sapiens (Human)
Description:ChEMBL_1438999
Residue:830
BDBM50067552
NameBDBM50067552
Synonyms:2-[(R)-2-(2-Tetradecyl-hexadecanoylamino)-3-(3,4,5-trihydroxy-6-methyl-tetrahydro-pyran-2-yloxy)-propionylamino]-pentanedioic acid 1-methyl ester | CHEMBL450011
TypeSmall organic molecule
Emp. Form.C45H84N2O11
Mol. Mass.829.1553
(CCCCCCCCCCCCCC)C(=O)N[C@H](COC1OC(C)C(O)C(O)C1O)C(=O)NC(CCC(O)=O)C(=O)OC