Reaction Details
TargetCathepsin B
LigandBDBM50369405
Substrate/Competitorn/a
Meas. Tech.ChEMBL_47416 (CHEMBL657293)
IC50 220±n/a nM
Citation Yasuma, TOi, SChoh, NNomura, TFuruyama, NNishimura, AFujisawa, YSohda, T Synthesis of peptide aldehyde derivatives as selective inhibitors of human cathepsin L and their inhibitory effect on bone resorption. J Med Chem41:4301-8 (1998) 
 
Cathepsin B
Name:Cathepsin B
Type:Enzyme
Mol. Mass.:37819.69
Organism:Homo sapiens (Human)
Description:gi_63102437
Residue:339
BDBM50369405
NameBDBM50369405
Synonyms:CHEMBL1790991
TypeSmall organic molecule
Emp. Form.C25H27F3N4O3
Mol. Mass.488.5021
SMILESCC[C@@H](C)[C@H](NC(=O)Nc1ccccc1C(F)(F)F)C(=O)N[C@H](Cc1c[nH]c2ccccc12)C=O