Reaction Details
TargetCathepsin B
LigandBDBM50067606
Substrate/Competitorn/a
Meas. Tech.ChEMBL_47416 (CHEMBL657293)
IC50 100±n/a nM
Citation Yasuma, TOi, SChoh, NNomura, TFuruyama, NNishimura, AFujisawa, YSohda, T Synthesis of peptide aldehyde derivatives as selective inhibitors of human cathepsin L and their inhibitory effect on bone resorption. J Med Chem41:4301-8 (1998) 
 
Cathepsin B
Name:Cathepsin B
Type:Enzyme
Mol. Mass.:37819.69
Organism:Homo sapiens (Human)
Description:gi_63102437
Residue:339
BDBM50067606
NameBDBM50067606
Synonyms:(S)-3-Methyl-2-(naphthalene-1-sulfonylamino)-pentanoic acid ((S)-1-formyl-3-methyl-butyl)-amide | CHEMBL134494
TypeSmall organic molecule
Emp. Form.C22H30N2O4S
Mol. Mass.418.55
SMILESCCC(C)[C@H](NS(=O)(=O)c1cccc2ccccc12)C(=O)N[C@@H](CC(C)C)C=O