Reaction Details
TargetProcathepsin L
LigandBDBM50369407
Substrate/Competitorn/a
Meas. Tech.ChEMBL_48494 (CHEMBL660643)
IC50 6.1±n/a nM
Citation Yasuma, TOi, SChoh, NNomura, TFuruyama, NNishimura, AFujisawa, YSohda, T Synthesis of peptide aldehyde derivatives as selective inhibitors of human cathepsin L and their inhibitory effect on bone resorption. J Med Chem41:4301-8 (1998) 
 
Procathepsin L
Name:Procathepsin L
Type:Enzyme
Mol. Mass.:37557.19
Organism:Homo sapiens (Human)
Description:Purchased from Calbiochem (San Diego, CA).
Residue:333
BDBM50369407
NameBDBM50369407
Synonyms:CHEMBL1790990
TypeSmall organic molecule
Emp. Form.C25H30N4O3
Mol. Mass.434.5307
SMILESCC[C@@H](C)[C@H](NC(=O)NCc1ccccc1)C(=O)N[C@H](Cc1c[nH]c2ccccc12)C=O