Reaction Details
TargetProcathepsin L
LigandBDBM50067607
Substrate/Competitorn/a
Meas. Tech.ChEMBL_48494 (CHEMBL660643)
IC50 5.3±n/a nM
Citation Yasuma, TOi, SChoh, NNomura, TFuruyama, NNishimura, AFujisawa, YSohda, T Synthesis of peptide aldehyde derivatives as selective inhibitors of human cathepsin L and their inhibitory effect on bone resorption. J Med Chem41:4301-8 (1998) 
 
Procathepsin L
Name:Procathepsin L
Type:Enzyme
Mol. Mass.:37557.19
Organism:Homo sapiens (Human)
Description:Purchased from Calbiochem (San Diego, CA).
Residue:333
BDBM50067607
NameBDBM50067607
Synonyms:(S)-N-[(R)-1-Formyl-2-(1H-indol-3-yl)-ethyl]-2-(naphthalene-1-sulfonylamino)-propionamide | CHEMBL342189
TypeSmall organic molecule
Emp. Form.C24H23N3O4S
Mol. Mass.449.522
SMILESC[C@H](NS(=O)(=O)c1cccc2ccccc12)C(=O)N[C@H](Cc1c[nH]c2ccccc12)C=O