Reaction Details
TargetCannabinoid receptor 1
LigandBDBM50067730
Substrate/Competitorn/a
Meas. Tech.ChEMBL_46827 (CHEMBL658061)
Ki 1.2±n/a nM
Citation Singer, MRyan, WJSaha, BMartin, BRRazdan, RK Potent cyano and carboxamido side-chain analogues of 1', 1'-dimethyl-delta8-tetrahydrocannabinol. J Med Chem41:4400-7 (1998) 
 
Cannabinoid receptor 1
Name:Cannabinoid receptor 1
Type:G Protein-Coupled Receptor (GPCR)
Mol. Mass.:52868.96
Organism:Homo sapiens (Human)
Description:P21554
Residue:472
BDBM50067730
NameBDBM50067730
Synonyms:6-((6aR,10aR)-1-Hydroxy-6,6,9-trimethyl-6a,7,10,10a-tetrahydro-6H-benzo[c]chromen-3-yl)-6-methyl-heptanoic acid piperidin-1-ylamide CHEMBL138772
TypeSmall organic molecule
Emp. Form.C29H44N2O3
Mol. Mass.468.6713
SMILESCC1=CC[C@@H]2[C@@H](C1)c1c(O)cc(cc1OC2(C)C)C(C)(C)CCCCC(=O)NN1CCCCC1