Reaction Details
TargetCannabinoid receptor 1
LigandBDBM50067736
Substrate/Competitorn/a
Meas. Tech.ChEMBL_46827 (CHEMBL658061)
Ki 13±n/a nM
Citation Singer, MRyan, WJSaha, BMartin, BRRazdan, RK Potent cyano and carboxamido side-chain analogues of 1', 1'-dimethyl-delta8-tetrahydrocannabinol. J Med Chem41:4400-7 (1998) 
 
Cannabinoid receptor 1
Name:Cannabinoid receptor 1
Type:G Protein-Coupled Receptor (GPCR)
Mol. Mass.:52868.96
Organism:Homo sapiens (Human)
Description:P21554
Residue:472
BDBM50067736
NameBDBM50067736
Synonyms:2-Hydroxy-6-((6aR,10aR)-1-hydroxy-6,6,9-trimethyl-6a,7,10,10a-tetrahydro-6H-benzo[c]chromen-3-yl)-6-methyl-heptanenitrile | CHEMBL337094
TypeSmall organic molecule
Emp. Form.C24H33NO3
Mol. Mass.383.5237
SMILESCC1=CC[C@@H]2[C@@H](C1)c1c(O)cc(cc1OC2(C)C)C(C)(C)CCCC(O)C#N