Reaction Details
TargetPeptidyl-prolyl cis-trans isomerase FKBP1A
LigandBDBM50068572
Substrate/Competitorn/a
Meas. Tech.ChEMBL_66273 (CHEMBL678143)
Ki 30±n/a nM
Citation Hamilton, GSSteiner, JP Immunophilins: beyond immunosuppression. J Med Chem41:5119-43 (1999) 
 
Peptidyl-prolyl cis-trans isomerase FKBP1A
Name:Peptidyl-prolyl cis-trans isomerase FKBP1A
Type:Isomerase
Mol. Mass.:11953.09
Organism:Homo sapiens (Human)
Description:P62942
Residue:108
BDBM50068572
NameBDBM50068572
Synonyms:1-(3,3-Dimethyl-2-oxo-pentanoyl)-piperidine-2-carboxylic acid 4-phenyl-1-(3-phenyl-propyl)-butyl ester | CHEMBL298173
TypeSmall organic molecule
Emp. Form.C32H43NO4
Mol. Mass.505.6881
SMILESCCC(C)(C)C(=O)C(=O)N1CCCCC1C(=O)OC(CCCc1ccccc1)CCCc1ccccc1