Reaction Details
TargetPeptidyl-prolyl cis-trans isomerase FKBP1A
LigandBDBM50068567
Substrate/Competitorn/a
Meas. Tech.ChEMBL_66273 (CHEMBL678143)
Ki 8000±n/a nM
Citation Hamilton, GSSteiner, JP Immunophilins: beyond immunosuppression. J Med Chem41:5119-43 (1999) 
 
Peptidyl-prolyl cis-trans isomerase FKBP1A
Name:Peptidyl-prolyl cis-trans isomerase FKBP1A
Type:Isomerase
Mol. Mass.:11953.09
Organism:Homo sapiens (Human)
Description:P62942
Residue:108
BDBM50068567
NameBDBM50068567
Synonyms:1-Methoxyoxalyl-piperidine-2-carboxylic acid benzyl ester | CHEMBL149708
TypeSmall organic molecule
Emp. Form.C16H19NO5
Mol. Mass.305.3258
SMILESCOC(=O)C(=O)N1CCCCC1C(=O)OCc1ccccc1