Reaction Details
TargetPeptidyl-prolyl cis-trans isomerase FKBP1A
LigandBDBM50068586
Substrate/Competitorn/a
Meas. Tech.ChEMBL_66273 (CHEMBL678143)
Ki 12±n/a nM
Citation Hamilton, GSSteiner, JP Immunophilins: beyond immunosuppression. J Med Chem41:5119-43 (1999) 
 
Peptidyl-prolyl cis-trans isomerase FKBP1A
Name:Peptidyl-prolyl cis-trans isomerase FKBP1A
Type:Isomerase
Mol. Mass.:11953.09
Organism:Homo sapiens (Human)
Description:P62942
Residue:108
BDBM50068586
NameBDBM50068586
Synonyms:1-(3,3-Dimethyl-2-oxo-pentanoyl)-piperidine-2-carboxylic acid 3-(2,5-dimethoxy-phenyl)-propyl ester | CHEMBL342735
TypeSmall organic molecule
Emp. Form.C24H35NO6
Mol. Mass.433.5378
SMILESCCC(C)(C)C(=O)C(=O)N1CCCCC1C(=O)OCCCc1cc(OC)ccc1OC