Reaction Details
TargetPeptidyl-prolyl cis-trans isomerase FKBP1A
LigandBDBM50068591
Substrate/Competitorn/a
Meas. Tech.ChEMBL_66273 (CHEMBL678143)
Ki 24±n/a nM
Citation Hamilton, GSSteiner, JP Immunophilins: beyond immunosuppression. J Med Chem41:5119-43 (1999) 
 
Peptidyl-prolyl cis-trans isomerase FKBP1A
Name:Peptidyl-prolyl cis-trans isomerase FKBP1A
Type:Isomerase
Mol. Mass.:11953.09
Organism:Homo sapiens (Human)
Description:P62942
Residue:108
BDBM50068591
NameBDBM50068591
Synonyms:1-(3,3-Dimethyl-2-oxo-butyryl)-piperidine-2-carboxylic acid 4-(4-methoxy-phenyl)-butyl ester | CHEMBL51710
TypeSmall organic molecule
Emp. Form.C23H33NO5
Mol. Mass.403.5118
SMILESCOc1ccc(CCCCOC(=O)C2CCCCN2C(=O)C(=O)C(C)(C)C)cc1