Reaction Details
TargetMethylated-DNA--protein-cysteine methyltransferase
LigandBDBM50068780
Substrate/Competitorn/a
Meas. Tech.ChEMBL_144711 (CHEMBL751006)
IC50 130±n/a nM
Citation McElhinney, RSDonnelly, DJMcCormick, JEKelly, JWatson, AJRafferty, JAElder, RHMiddleton, MRWillington, MAMcMurry, TBMargison, GP Inactivation of O6-alkylguanine-DNA alkyltransferase. 1. Novel O6-(hetarylmethyl)guanines having basic rings in the side chain. J Med Chem41:5265-71 (1999) 
 
Methylated-DNA--protein-cysteine methyltransferase
Name:Methylated-DNA--protein-cysteine methyltransferase
Type:PROTEIN
Mol. Mass.:21651.27
Organism:Homo sapiens (Human)
Description:ChEMBL_144711
Residue:207
BDBM50068780
NameBDBM50068780
Synonyms:6-(Pyridin-4-ylmethoxy)-6,9-dihydro-1H-purin-2-ylamine | CHEMBL146734
TypeSmall organic molecule
Emp. Form.C11H12N6O
Mol. Mass.244.2526
SMILESNC1=Nc2nc[nH]c2C(N1)OCc1ccncc1