Reaction Details
TargetNeuronal acetylcholine receptor subunit alpha-4/beta-2
LigandBDBM50062641
Substrate/Competitorn/a
Meas. Tech.ChEMBL_143545 (CHEMBL755318)
Ki 0.055±n/a nM
Citation Holladay, MWWasicak, JTLin, NHHe, YRyther, KBBannon, AWBuckley, MJKim, DJDecker, MWAnderson, DJCampbell, JEKuntzweiler, TADonnelly-Roberts, DLPiattoni-Kaplan, MBriggs, CAWilliams, MArneric, SP Identification and initial structure-activity relationships of (R)-5-(2-azetidinylmethoxy)-2-chloropyridine (ABT-594), a potent, orally active, non-opiate analgesic agent acting via neuronal nicotinic acetylcholine receptors. J Med Chem41:407-12 (1998) 
 
Neuronal acetylcholine receptor subunit alpha-4/beta-2
Name:Neuronal acetylcholine receptor subunit alpha-4/beta-2
Type:Protein
Mol. Mass.:n/a
Description:n/a
Components:This complex has 2 components.
Component 1
Name:Neuronal acetylcholine receptor subunit alpha-4
Synonyms:ACHA4_HUMAN CHRNA4 protein Neuronal acetylcholine receptor protein alpha-4 subunit Nicotinic acetylcholine receptor alpha4/beta2/alpha5
Type:n/a
Mol. Mass.:69963.49
Organism:Homo sapiens (Human)
Description:NACHRA4
Residue:627
Component 2
Name:Neuronal acetylcholine receptor subunit beta-2
Synonyms:ACHB2_HUMAN Neuronal acetylcholine receptor protein beta-2 subunit | Nicotinic acetylcholine receptor alpha3/beta2/alpha5
Type:Protein
Mol. Mass.:57020.50
Organism:Homo sapiens (Human)
Description:P17787
Residue:502
BDBM50062641
NameBDBM50062641
Synonyms:5-((R)-1-Azetidin-2-ylmethoxy)-2-chloro-pyridine TEBENICILINE | Tebanicline tosylate
TypeSmall organic molecule
Emp. Form.C9H11ClN2O
Mol. Mass.198.649
SMILESClc1ccc(OC[C@H]2CCN2)cn1